Home > Fatal Error > Winavr Error

Winavr Error

Contents

Log in or register to post comments Top DavidEGrayson Level: New Member Joined: Thu. USBaspLoader owner baerwolf commented Dec 21, 2013 Thank you, too. This also includes the rebase fix already, which was already present in the latest version of WinAVR. Also, when you figgure it out post a little message to let us know, and what was causing the problem, esp if it was different than daqq's. http://3cq.org/fatal-error/winavr-error-1.php

BR Stephan baerwolf closed this Dec 21, 2013 Sign up for free to join this conversation on GitHub. DEBUG = dwarf-2 # List any extra directories to look for include files here. # Each directory must be seperated by a space. # Use forward slashes for directory separators. # Corporate Address Bhau Institute Of Innovation, Entrepreneurship and Leadership [ BIEL ], College Of Engineering Pune [ COEP ], SHIVAJI NAGAR, PUNE, MAHARASHTRA,INDIA Mobile Number- +91 770 947 3986 Email Id- Stop. (1) 8051: "Emulation" vs (non-emulated) target-debuggi (1) "make" command (make sim_tb test=reg_test) to run (1) wanted """""waveguide E-plane filte (2) Part and Inventory Search Top Helped / Month Okada (2), http://www.avrfreaks.net/forum/error-when-building-studio-4-and-winavr-help

Fatal Error Opening Dependency File .dep/main.o.d No Such File Or Directory

c:\Programmi\WinAVR\bin\avr-objcopy.exe: --change-section-lma .eeprom=0x00000000 never used make.exe: *** [mainfile.eep] Error 1 While with the previous version this didn't happen. Jan 3, 2006 Posts: 314 View posts Location: Wisconsin, USA #15 Posted by bnemec: Mon. You signed in with another tab or window. See avr-libc FAQ.) OPT = s # Debugging format. # Native formats for AVR-GCC's -g are dwarf-2 [default] or stabs. # AVR Studio 4.10 requires dwarf-2. # AVR [Extended] COFF format

It's not easy. Jan 14, 2012 - 12:48 PM 12345Total votes: 0 Quote: I am getting the following error while building the code "undefined reference to main" None of the .o files being linked I wish you a Merry Christmas. Winavr Fatal Error Opening Dependency File avr-objcopy -j .eeprom --set-section-flags=.eeprom="alloc,load" --change-section-lma .eeprom=0 -O ihex mainfile.elf mainfile.eep [No errors] Is this correct?

make: *** [main.o] Error 1 Build failed with 1 errors and 0 warnings... Does anyone know the solution? DEBUG_MFREQ = $(F_CPU) # Set the DEBUG_UI to either gdb or insight. # DEBUG_UI = gdb DEBUG_UI = insight # Set the debugging back-end to either avarice, simulavr. http://www.avrfreaks.net/forum/winavr-error-couldnt-reserve-space-cygwins-heap Securing a LAN that has multiple exposed external at Cat 6 cable runs?

He came on so loaded man, well [..] and snow white tan. [Bowie] "Some questions have no answers."[C Baird] "There comes a point where the spoon-feeding has to stop and Fatal Error Opening Dependency File Permission Denied ALL_CFLAGS = -mmcu=$(MCU) -I. $(CFLAGS) $(GENDEPFLAGS) ALL_CPPFLAGS = -mmcu=$(MCU) -I. -x c++ $(CPPFLAGS) $(GENDEPFLAGS) ALL_ASFLAGS = -mmcu=$(MCU) -I. -x assembler-with-cpp $(ASFLAGS) # Default target. I was misled by the cygwin error. Jan 11, 2012 - 06:02 PM 12345Total votes: 0 Build failed...

Fatal Error Opening Dependency File No Such File Or Directory

Sep 12, 2009 - 05:29 PM 12345Total votes: 0 lfmorrison wrote: I wonder if it would be possible to compile WinAVR to take advantage of the Microsoft POSIX subsystem (present since check my site Log in or register to post comments Top ArnoldB Level: Raving Lunatic Joined: Thu. Fatal Error Opening Dependency File .dep/main.o.d No Such File Or Directory clean: begin clean_list end clean_list : @echo @echo $(MSG_CLEANING) $(REMOVE) $(TARGET).hex $(REMOVE) $(TARGET).eep $(REMOVE) $(TARGET).cof $(REMOVE) $(TARGET).elf $(REMOVE) $(TARGET).map $(REMOVE) $(TARGET).sym $(REMOVE) $(TARGET).lss $(REMOVEDIR) $(OBJDIR) $(REMOVE) $(SRC:.c=.s) $(REMOVE) $(SRC:.c=.d) $(REMOVEDIR) .dep Winavr Windows 10 R.

also I think following link could help to analyze your issue cygwin.com/ml/cygwin/2008-06/msg00026.html –Sergei Nikulov Oct 28 '11 at 12:56 Determining if the C compiler works failed with the following See the next to last post in this thread. PRINTF_LIB = #PRINTF_LIB = $(PRINTF_LIB_MIN) #PRINTF_LIB = $(PRINTF_LIB_FLOAT) # Minimalistic scanf version SCANF_LIB_MIN = -Wl,-u,vfscanf -lscanf_min # Floating point + %[ scanf version (requires MATH_LIB = -lm below) SCANF_LIB_FLOAT = -Wl,-u,vfscanf Log in or register to post comments Top alexan_e Level: Resident Joined: Thu. Fatal Error Opening Dependency File Avr Studio

The DOD didn't specify that application software needs to be written only using POSIX APIs, just that the OS as such has POSIX APIs. That is bad M-k? Starting with XP it was no longer shipped. I tried a few and got error message that I had no compiler chosen?

Sep 2, 2015 - 04:53 AM 12345Total votes: 0 #include #include void main() { unsigned int adc_value; DDRB|=(1< adc_init(); While(1) { while (ADCSRA&(1<It seems that there is some other MAKE earlier in the path and this interferes.

I solved it by placing a separate copy of the correct MAKE.exe in the project directory

Main cause of the problem was a new version of msvcrt.dll that did additional parameter checking. more hot questions question feed about us tour help blog chat data legal privacy policy work here advertising info mobile contact us feedback Technology Life / Arts Culture / Recreation Science Jan 12, 2012 - 07:50 AM 12345Total votes: 0 Hit the "...config. Avr-gcc.exe The Application Was Unable To Start Correctly c:\Programmi\WinAVR\bin\avr-objcopy.exe: --change-section-lma .eeprom=0x00000000 never used make.exe: *** [mainfile.eep] Error 1 While with the previous version this didn't happen.

Jan 14, 2012 - 08:10 AM 12345Total votes: 0 I am getting the following error while building the code "undefined reference to main" pls help me Log in or register to Log in or register to post comments Top steve17 Level: Raving Lunatic Joined: Tue. Smiley Log in or register to post comments Top vikaskapur Level: New Member Joined: Sun. We recommend upgrading to the latest Safari, Google Chrome, or Firefox.

make: *** [main.o] Error 1 Build failed with 1 errors and 0 warnings… Before Windows upgrading compilation was correct. Errors on *.elf ? You must use the default WinAVR install locations. USA #1 Posted by MotoDog: Wed.

GENDEPFLAGS = -MD -MP -MF .dep/$(@F).d # Combine all necessary flags and optional flags. # Add target processor to flags. I un-checked AVR Tool Chain and tried a few times. If you are using Vista 64-bits, you will probably have the sync_with_child or similar errors. COFFCONVERT = $(OBJCOPY) --debugging COFFCONVERT += --change-section-address .data-0x800000 COFFCONVERT += --change-section-address .bss-0x800000 COFFCONVERT += --change-section-address .noinit-0x800000 COFFCONVERT += --change-section-address .eeprom-0x810000 coff: $(TARGET).elf @echo @echo $(MSG_COFF) $(TARGET).cof $(COFFCONVERT) -O coff-avr $< $(TARGET).cof

Nov 16, 2012 - 12:24 PM 12345Total votes: 0 sr my code is........ #include #include

#define LCD_DATA PORTA // LCD data port #define ctrl PORTB #define en PB2 // enable signal Not the answer you're looking for? Actually searching on "Exit Code: 2" probably isn't the best solution here, since it covers so many errors that cause the compiler to give up.